{"text_format":"1","workbook":"xlsx","n_sheets":20,"sheets":["Instructions & Definitions","Plan and Building Inputs","Engineering Inspection Inputs","Calculated Fees","Without Subs (OTC Permits)","With Subs (Plan & Building)","Minimum Project Values","Accela Options","To Do","Dropdowns","Electric","Comm Revenue Elec Fee","County TCEF","Schools","Stormwater","Water WW","Capital Expansion","Reference ->","Water","pud calculation"],"not_rendered":{"charts":0,"images":13,"macros":1,"external_links":0,"defined_names":8,"comments":0,"pivot_tables":0},"unopened":[],"bounds":{"document_bytes":16777216,"sheet_cells":100000,"rows_first":2000,"rows_last":500,"rows_between":2000,"halvings":0,"cell_chars":16384,"cell_head_chars":4096},"cells_cut":0,"cells_raw":0,"read":"whole","date_system":"1900"}

{"sheet":"Instructions & Definitions","index":0,"n_rows":15,"n_cols":2,"rows_kept":15,"cut":false,"hidden":false,"merged":[[9,1,9,9],[11,1,11,9]]}
[]
[]
[]
[]
[]
[]
{"$rows_left_out":10}
{"sheet":"Plan and Building Inputs","index":1,"n_rows":96,"n_cols":20,"rows_kept":96,"cut":false,"hidden":false,"merged":[[15,3,22,3],[8,3,9,3],[10,3,14,3],[48,1,48,3],[3,3,6,3]]}
[]
[null,"Step 2: Enter the detail of the construction project to estimate the city fees, enter data only in grey cells"]
[]
[null,"Type",null,"Drop down"]
[null,"Sub-Type"]
[null,"Change of Use?"]
{"$rows_left_out":91}
{"sheet":"Engineering Inspection Inputs","index":2,"n_rows":64,"n_cols":7,"rows_kept":64,"cut":false,"hidden":false,"merged":[]}
[]
[null,"Step 4: Enter data to calculate estimated Public Infrastructure Inspection Fees"]
[]
["Description (List all Public and applicable *private improvements)","Units of Measure","Estimated Quantity (provided by the project engineer)","Infrastructure construction cost per unit","Total Estimated Infrastructure Cost","Inspection Fee per unit (provided by the City)","Total Inspection Fee"]
["Sanitary Sewer System"]
["Sanitary Sewer Main","L.F.",0,0,{"$f":"C6*D6","v":0},0.7,{"$f":"IF(C6=0,0,IF(C6<=100,70,((C6-100)*F6)+70))","v":0}]
{"$rows_left_out":59}
{"sheet":"Calculated Fees","index":3,"n_rows":37,"n_cols":5,"rows_kept":37,"cut":false,"hidden":false,"merged":[]}
[]
[null,"Fee Type","Amount","Links for additional Info"]
[null,"Police Capital Exp",{"$f":"+'Capital Expansion'!P14","v":0},"https://www.fcgov.com/finance/capitalexpansion.php","https://www.fcgov.com/developmentreview/fees.php"]
[null,"Fire Capital Exp",{"$f":"+'Capital Expansion'!O14","v":0},"https://www.fcgov.com/finance/capitalexpansion.php"]
[null,"Parkland: Community",{"$f":"+'Capital Expansion'!N14","v":0},"https://www.fcgov.com/finance/capitalexpansion.php"]
[null,"Parkland: Neighborhood",{"$f":"+'Capital Expansion'!M14","v":0},"https://www.fcgov.com/finance/capitalexpansion.php"]
{"$rows_left_out":32}
{"sheet":"Without Subs (OTC Permits)","index":4,"n_rows":37,"n_cols":9,"rows_kept":37,"cut":false,"hidden":true,"merged":[]}
[]
["Type","Sub-Type City of Fort Collins","Project Value","Sales & Use Tax","County Sales & Use Tax","Building Permit Fee","Plan Check Fee","Total Fee"]
[{"$f":"'Plan and Building Inputs'!$C$4","v":0},"Fireplace",{"$f":"IF(B3='Plan and Building Inputs'!$C$7,'Plan and Building Inputs'!$C$15,0)","v":0},{"$f":"+C3*(0.0385)/2","v":0},{"$f":"+C3/2*0.0055","v":0},{"$f":"IF(C3=0,0,(IF(C3<=500,25,IF(AND(C3>500,C3<=2000),25+ROUNDUP((C3-500)/100,0)*2.75,IF(AND(C3>2000,C3<=25000),66.25+ROUNDUP((C3-2000)/1000,0)*10.25,IF(AND(C3>25000,C3<=50000),302+ROUNDUP((C3-25000)/1000,0)*8.5,IF(AND(C3>50000,C3<=100000),514.5+ROUNDUP((C3-50000)/1000,0)*6,IF(AND(C3>100000,C3<=500000),814.5+ROUNDUP((C3-100000)/1000,0)*4,IF(AND(C3>500000,C3<=1000000),2414.5+ROUNDUP((C3-500000)/1000,0)*3.5,IF(AND(C3>1000000,C3<=10000000),4164.5+ROUNDUP((C3-1000000)/1000,0)*2.5,26664.5+ROUNDUP((C3-10000000)/1000,0)))))))))))","v":0},{"$f":"IF(AND(A3=\"Commercial (Single Phase)\"),0,IF(AND(C3>0,A3=\"Residential\",IFERROR(MATCH(B3,$A$23:$A$28,0),0)),25,IF(C3<=3000,0,IF(AND(C3>3000,C3<=25000),(66.25+ROUNDUP((C3-2000)/1000,0)*10.25)*0.65,IF(AND(C3>25000,C3<=50000),(302+ROUNDUP((C3-25000)/1000,0)*8.5)*0.65,IF(AND(C3>50000,C3<=100000),(514.5+ROUNDUP((C3-50000)/1000,0)*6)*0.65,IF(AND(C3>100000,C3<=500000),(814.5+ROUNDUP((C3-100000)/1000,0)*4)*0.65,IF(AND(C3>500000,C3<=1000000),(2414.5+ROUNDUP((C3-500000)/1000,0)*3.5)*0.65,IF(AND(C3>1000000,C3<=10000000),(4164.5+ROUNDUP((C3-1000000)/1000,0)*2.5)*0.65,(26664.5+ROUNDUP((C3-10000000)/1000,0))*0.65)))))))))","v":0},{"$f":"+D3+F3+G3","v":0}]
[{"$f":"'Plan and Building Inputs'!$C$4","v":0},"Air Conditioning",{"$f":"IF(B4='Plan and Building Inputs'!$C$7,'Plan and Building Inputs'!$C$15,0)","v":0},{"$f":"+C4*(0.0385)/2","v":0},{"$f":"+C4/2*0.0055","v":0},{"$f":"IF(C4=0,0,(IF(C4<=500,25,IF(AND(C4>500,C4<=2000),25+ROUNDUP((C4-500)/100,0)*2.75,IF(AND(C4>2000,C4<=25000),66.25+ROUNDUP((C4-2000)/1000,0)*10.25,IF(AND(C4>25000,C4<=50000),302+ROUNDUP((C4-25000)/1000,0)*8.5,IF(AND(C4>50000,C4<=100000),514.5+ROUNDUP((C4-50000)/1000,0)*6,IF(AND(C4>100000,C4<=500000),814.5+ROUNDUP((C4-100000)/1000,0)*4,IF(AND(C4>500000,C4<=1000000),2414.5+ROUNDUP((C4-500000)/1000,0)*3.5,IF(AND(C4>1000000,C4<=10000000),4164.5+ROUNDUP((C4-1000000)/1000,0)*2.5,26664.5+ROUNDUP((C4-10000000)/1000,0)))))))))))","v":0},0,{"$f":"+D4+F4+G4","v":0}]
[{"$f":"'Plan and Building Inputs'!$C$4","v":0},"Furnace",{"$f":"IF(B5='Plan and Building Inputs'!$C$7,'Plan and Building Inputs'!$C$15,0)","v":0},{"$f":"+C5*(0.0385)/2","v":0},{"$f":"+C5/2*0.0055","v":0},0,0,0]
[{"$f":"'Plan and Building Inputs'!$C$4","v":0},"Mechanical",{"$f":"IF(B6='Plan and Building Inputs'!$C$7,'Plan and Building Inputs'!$C$15,0)","v":0},{"$f":"+C6*(0.0385)/2","v":0},{"$f":"+C6/2*0.0055","v":0},0,0,0]
{"$rows_left_out":32}
{"sheet":"With Subs (Plan & Building)","index":5,"n_rows":17,"n_cols":8,"rows_kept":17,"cut":false,"hidden":true,"merged":[]}
[]
["Value Plan",null,"Total Valuation","Plan Review","Building Permit Fee w/ Subs","Value","Plan Fee","Permit Fee w/ Subs"]
[]
[{"$f":"+'Plan and Building Inputs'!$C$15","v":0},null,"$1 to $500","None",25,{"$f":"AND(A4<=500,'Plan and Building Inputs'!$C$7=\"Mobile Home\")","v":false},0,25]
[{"$f":"+'Plan and Building Inputs'!$C$15","v":0},null,"$501 to $2,000","None","$25 for the first $500 plus $2.75 for each additional $100 or fraction thereof to and including $2,000",{"$f":"AND(A5>501, A5<=2000)","v":false},0,{"$f":"25+ROUNDUP((A5-500)/100,0)*2.75","v":11.25}]
[{"$f":"+'Plan and Building Inputs'!$C$15","v":0},null,"$2,001 to $3,000","No plan review fee for valuations $3,000 and under.","Use the formula in the column to the left, but take this total times 1.35",{"$f":"AND(A6>2001, A6<=3000)","v":false},0,{"$f":"(66.25+ROUNDUP((A6-2000)/1000,0)*10.25)*1.35","v":61.762500000000003}]
{"$rows_left_out":12}
{"sheet":"Minimum Project Values","index":6,"n_rows":32,"n_cols":9,"rows_kept":32,"cut":false,"hidden":true,"merged":[]}
[]
[null,null,null,"Type","Area","Square Feet","Cost/Sq Ft","Total"]
[null,null,null,null,"Garage",{"$f":"'Plan and Building Inputs'!C35","v":0},37.299999999999997,{"$f":"+G3*F3","v":0}]
[null,null,null,null,"Pole Barn (Post Frame Const)",{"$f":"'Plan and Building Inputs'!C36","v":0},29,{"$f":"+G4*F4","v":0}]
[null,null,null,null,"Carport",{"$f":"'Plan and Building Inputs'!C37","v":0},27.9,0]
[null,null,null,null,"Fabric Carport",{"$f":"'Plan and Building Inputs'!C38","v":0},1.5,0]
{"$rows_left_out":27}
{"sheet":"Accela Options","index":7,"n_rows":50,"n_cols":8,"rows_kept":50,"cut":false,"hidden":true,"merged":[]}
[null,null,"Group","Type","Subtype","Category","Building Permit # used to validate","Comment"]
[null,null,"Building","Addition","Commercial","na","B1801026","Off captial expansion"]
[null,null,"Building","Addition","Residential","na","B1802186","X"]
[null,null,"Building","Alteration","Commercial","CFB","looks like we don't do these anymore"]
[null,null,"Building","Alteration","Commercial","General","B1803506","X"]
[null,null,"Building","Alteration","Commercial","Minor","B1800398","X"]
{"$rows_left_out":45}
{"sheet":"To Do","index":8,"n_rows":23,"n_cols":2,"rows_kept":23,"cut":false,"hidden":true,"merged":[]}
[]
[]
["Tyler siegmund - Electric Dev Rev"]
[]
[]
[]
{"$rows_left_out":18}
{"sheet":"Dropdowns","index":9,"n_rows":42,"n_cols":21,"rows_kept":42,"cut":false,"hidden":true,"merged":[]}
[]
[null,"Type","DropDown1","Residential","Commercial (Single Phase)","Office and Other Services (3-phase)","Industrial/Warehouse (Large Comm)",null,null,null,null,null,null,null,null,null,"Amps",null,"Voltage"]
[null,"Commercial (Single Phase)","Addition","--","--","Church/Synagogue","General Ligh Industrial/Industrial Park",null,null,"3/4 inch",null,"Yes",null,"Single Family",null,null,150,null,208,null,"Single"]
[null,"Industrial/Warehouse (Large Comm)","Alteration","Accessory Living Area - Attached","Auto Sales (& Speciality Retail)","Day Care Center","Mini-Warehouse",null,null,"1 inch",null,"No",null,"Duplex",null,null,200,null,240,null,"Three"]
[null,"Office and Other Services (3-phase)","Minor Permit","Accessory Living Area - Detached","Auto Service/Repair/Tire Store","Elementary/Secondary School","Warehouse",null,null,"1-1/2 inch",null,"--",null,"Multi-Family",null,null,"EH",null,277]
[null,"Residential","New","Air Conditioning","Bank","Hospital",null,null,null,"2 inch",null,null,null,"--",null,null,"--",null,480]
{"$rows_left_out":37}
{"sheet":"Electric","index":10,"n_rows":32,"n_cols":17,"rows_kept":32,"cut":false,"hidden":true,"merged":[]}
["Type","Sub Type","# of units","Amps","Phase ","Voltage","Category",null,"Phase",null,null,null,"Voltage","Calculated kW","$/kW","Cost per Unit","Amount"]
[{"$f":"+'Plan and Building Inputs'!$C$4","v":0},{"$f":"+'Plan and Building Inputs'!$C$7","v":0},{"$f":"+'Plan and Building Inputs'!$C$14","v":0},{"$f":"+'Plan and Building Inputs'!$C$30","v":0},{"$f":"+'Plan and Building Inputs'!$C$29","v":0},{"$f":"+'Plan and Building Inputs'!$C$31","v":0},{"$f":"IF(AND(A2=\"Residential\", B2=\"Single Family\"), \"Single Family\", IF(AND(A2=\"Residential\", B2<>\"Single Family\"), \"Multi-Family\", \"Commercial\"))","v":"Commercial"},{"$f":"IF(G2=\"Single Family\", \"SF \"&D2&\" Amp\", IF(G2=\"Multi-Family\", \"MF \"&D2&\" Amp\", D2))","v":0},{"$f":"'Plan and Building Inputs'!$C$29","v":0},{"$f":"IF('Plan and Building Inputs'!$C$10=\"Yes\",IF(A2=\"Residential\",H2=M2,FALSE),FALSE)","v":false},"Residential","Single Family","SF 150 Amp",null,null,1537,{"$f":"C2*P2","v":0}]
[{"$f":"+'Plan and Building Inputs'!$C$4","v":0},{"$f":"+'Plan and Building Inputs'!$C$7","v":0},{"$f":"+'Plan and Building Inputs'!$C$14","v":0},{"$f":"+'Plan and Building Inputs'!$C$30","v":0},{"$f":"+'Plan and Building Inputs'!$C$29","v":0},{"$f":"+'Plan and Building Inputs'!$C$31","v":0},{"$f":"IF(AND(A3=\"Residential\", B3=\"Single Family\"), \"Single Family\", IF(AND(A3=\"Residential\", B3<>\"Single Family\"), \"Multi-Family\", \"Commercial\"))","v":"Commercial"},{"$f":"IF(G3=\"Single Family\", \"SF \"&D3&\" Amp\", IF(G3=\"Multi-Family\", \"MF \"&D3&\" Amp\", D3))","v":0},{"$f":"'Plan and Building Inputs'!$C$29","v":0},{"$f":"IF('Plan and Building Inputs'!$C$10=\"Yes\",IF(A3=\"Residential\",H3=M3,FALSE),FALSE)","v":false},"Residential","Single Family","SF 200 Amp",null,null,1879,{"$f":"C3*P3","v":0}]
[{"$f":"+'Plan and Building Inputs'!$C$4","v":0},{"$f":"+'Plan and Building Inputs'!$C$7","v":0},{"$f":"+'Plan and Building Inputs'!$C$14","v":0},{"$f":"+'Plan and Building Inputs'!$C$30","v":0},{"$f":"+'Plan and Building Inputs'!$C$29","v":0},{"$f":"+'Plan and Building Inputs'!$C$31","v":0},"Commercial",0,{"$f":"'Plan and Building Inputs'!$C$29","v":0},{"$f":"IF('Plan and Building Inputs'!$C$10=\"Yes\",IF(A4=\"Residential\",H4=M4,FALSE),FALSE)","v":false},"Residential","Single Family","SF EH Amp",null,null,2508,{"$f":"C4*P4","v":0}]
[{"$f":"+'Plan and Building Inputs'!$C$4","v":0},{"$f":"+'Plan and Building Inputs'!$C$7","v":0},{"$f":"+'Plan and Building Inputs'!$C$14","v":0},{"$f":"+'Plan and Building Inputs'!$C$30","v":0},{"$f":"+'Plan and Building Inputs'!$C$29","v":0},{"$f":"+'Plan and Building Inputs'!$C$31","v":0},"Commercial",0,{"$f":"'Plan and Building Inputs'!$C$29","v":0},{"$f":"IF('Plan and Building Inputs'!$C$10=\"Yes\",IF(A5=\"Residential\",H5=M5,FALSE),FALSE)","v":false},"Residential","Multi-Family","MF 150 Amp",null,null,1349.5364199798519,{"$f":"C5*P5","v":0}]
[{"$f":"+'Plan and Building Inputs'!$C$4","v":0},{"$f":"+'Plan and Building Inputs'!$C$7","v":0},{"$f":"+'Plan and Building Inputs'!$C$14","v":0},{"$f":"+'Plan and Building Inputs'!$C$30","v":0},{"$f":"+'Plan and Building Inputs'!$C$29","v":0},{"$f":"+'Plan and Building Inputs'!$C$31","v":0},"Commercial",0,{"$f":"'Plan and Building Inputs'!$C$29","v":0},{"$f":"IF('Plan and Building Inputs'!$C$10=\"Yes\",IF(A6=\"Residential\",H6=M6,FALSE),FALSE)","v":false},"Residential","Multi-Family","MF 200 Amp",null,null,2066.1437839988907,{"$f":"C6*P6","v":0}]
{"$rows_left_out":27}
{"sheet":"Comm Revenue Elec Fee","index":11,"n_rows":38,"n_cols":7,"rows_kept":38,"cut":false,"hidden":true,"merged":[]}
["Labor is Cacluated as Follows:",null,null,"Per Temp","Per Hour","Per Hour"]
["Services Supervisor",null,null,{"$f":"+E2*F2","v":30.954999999999998},61.91,0.5]
["Lineworker One",null,null,{"$f":"+E3*F3","v":28.27},56.54,0.5]
["Groundworker",null,null,{"$f":"+E4*F4","v":38.4},38.4,1]
[null,null,null,{"$f":"SUM(D2:D4)","v":97.625},{"$f":"SUM(E2:E4)","v":156.85}]
[]
{"$rows_left_out":33}
{"sheet":"County TCEF","index":12,"n_rows":15,"n_cols":15,"rows_kept":15,"cut":false,"hidden":true,"merged":[]}
[]
[]
["Type","Category","Square Feet","Units",null,"Type","Category","Unit of Measure","Area Test","Type Test","Dwelling test","New/Addition","Cap Expansion Test","County ","Regional"]
[{"$f":"+'Plan and Building Inputs'!$C$4","v":0},{"$f":"+'Plan and Building Inputs'!$C$7","v":0},{"$f":"+'Plan and Building Inputs'!$C$11","v":0},{"$f":"+'Plan and Building Inputs'!$C$14","v":0},{"$f":"G4=B4","v":false},"Residential","Resid., up to 900 sf","1 Dwelling",{"$f":"C4<=900","v":true},{"$f":"A4=F4","v":false},{"$f":"IF(AND(A4=\"Residential\",'Plan and Building Inputs'!$C$13>0,'Without Subs (OTC Permits)'!$C$19=0),TRUE,FALSE)","v":false},{"$f":"IF(OR('Plan and Building Inputs'!$C$5=\"New\",'Plan and Building Inputs'!$C$5=\"Addition\"),TRUE,FALSE)","v":false},{"$f":"IF(AND(I4=TRUE,J4=TRUE,K4=TRUE),TRUE,FALSE)","v":false},1946,163]
[{"$f":"+'Plan and Building Inputs'!$C$4","v":0},{"$f":"+'Plan and Building Inputs'!$C$7","v":0},{"$f":"+'Plan and Building Inputs'!$C$11","v":0},{"$f":"+'Plan and Building Inputs'!$C$14","v":0},{"$f":"G5=B5","v":false},"Residential","Resid., 901-1,300 sf","1 Dwelling",{"$f":"AND(C5>901, C5<=1300)","v":false},{"$f":"A5=F5","v":false},{"$f":"IF(AND(A5=\"Residential\",'Plan and Building Inputs'!$C$13>0,'Without Subs (OTC Permits)'!$C$19=0),TRUE,FALSE)","v":false},{"$f":"IF(OR('Plan and Building Inputs'!$C$5=\"New\",'Plan and Building Inputs'!$C$5=\"Addition\"),TRUE,FALSE)","v":false},{"$f":"IF(AND(I5=TRUE,J5=TRUE,K5=TRUE),TRUE,FALSE)","v":false},2727,228]
[{"$f":"+'Plan and Building Inputs'!$C$4","v":0},{"$f":"+'Plan and Building Inputs'!$C$7","v":0},{"$f":"+'Plan and Building Inputs'!$C$11","v":0},{"$f":"+'Plan and Building Inputs'!$C$14","v":0},{"$f":"G6=B6","v":false},"Residential","Resid., 1,301-1,800 sf","1 Dwelling",{"$f":"AND(C6>1301, C6<=1800)","v":false},false,{"$f":"IF(AND(A6=\"Residential\",'Plan and Building Inputs'!$C$13>0,'Without Subs (OTC Permits)'!$C$19=0),TRUE,FALSE)","v":false},{"$f":"IF(OR('Plan and Building Inputs'!$C$5=\"New\",'Plan and Building Inputs'!$C$5=\"Addition\"),TRUE,FALSE)","v":false},false,3284,275]
{"$rows_left_out":10}
{"sheet":"Schools","index":13,"n_rows":26,"n_cols":9,"rows_kept":26,"cut":false,"hidden":true,"merged":[]}
[null,null,null,null,null,null,null,{"$f":"D3<=4","v":true},{"$f":"D3>4","v":false}]
["Type","Sub-Type City of Fort Collins","District","Units",null,null,null,"1-4 Unit","5+ Units"]
[{"$f":"'Plan and Building Inputs'!$C$4","v":0},{"$f":"+'Plan and Building Inputs'!$C$7","v":0},{"$f":"+'Plan and Building Inputs'!$C$32","v":0},{"$f":"+'Plan and Building Inputs'!$C$14","v":0},null,"Poudre",{"$f":"+IF(AND(C3=F3,'Plan and Building Inputs'!C5=\"New\",IFERROR(MATCH(B3,$A$15:$A$26,0),0)),TRUE,FALSE)","v":false},1710,855]
[{"$f":"'Plan and Building Inputs'!$C$4","v":0},{"$f":"+'Plan and Building Inputs'!$C$7","v":0},{"$f":"+'Plan and Building Inputs'!$C$32","v":0},{"$f":"+'Plan and Building Inputs'!$C$14","v":0},null,"Big Thompson",{"$f":"+IF(AND(C4=F4,'Plan and Building Inputs'!C6=\"New\",IFERROR(MATCH(B4,$A$15:$A$26,0),0)),TRUE,FALSE)","v":false},1382,946]
[]
[null,null,null,null,null,"Output",null,{"$f":"IFERROR(IF(A3=\"Residential\",VLOOKUP(TRUE, G3:I4, MATCH(TRUE, G1:I1, FALSE), FALSE)*D3, 0),0)","v":0}]
{"$rows_left_out":21}
{"sheet":"Stormwater","index":14,"n_rows":26,"n_cols":21,"rows_kept":26,"cut":false,"hidden":true,"merged":[]}
[]
[]
["Site Sq. Ft","Building Sq Ft","ROW","Parking/Drives/walks/patios","Gravel","Private O.S.","Public O.S","Gross:","% Impervious","% Gravel","% Pervious","Net Acres","Net % Impervious","Net % Semi-pervious","Net % Pervious","Cg","Cn","Rate Factor","Basin Rate:","SW PIF:","Review Charge:"]
[{"$f":"+'Plan and Building Inputs'!C16","v":0},{"$f":"+'Plan and Building Inputs'!C17","v":0},{"$f":"+'Plan and Building Inputs'!C18","v":0},{"$f":"+'Plan and Building Inputs'!C19","v":0},{"$f":"+'Plan and Building Inputs'!C20","v":0},{"$f":"+'Plan and Building Inputs'!C21","v":0},{"$f":"+'Plan and Building Inputs'!C22","v":0},{"$f":"SUM(B4:G4)","v":0},{"$f":"IFERROR(SUM(B4+C4+D4)/A4,0)","v":0},{"$f":"+IFERROR(E4/A4,0)","v":0},{"$f":"IFERROR((F4+G4)/A4,0)","v":0},{"$f":"A4-C4","v":0},{"$f":"IFERROR(SUM(B4+D4)/L4,0)","v":0},{"$f":"IFERROR(E4/L4,0)","v":0},{"$f":"IFERROR(SUM(F4+G4)/L4,0)","v":0},{"$f":"SUM(I4*0.95)+(J4*0.5)+(K4*0.2)","v":0},{"$f":"(M4*0.95)+(N4*0.05)+(O4*0.2)","v":0},{"$f":"IF(M4<=0.3, 0.25, IF(AND(M4>0.31, M4<=0.5), 0.4, IF(AND(M4>0.51, M4<=0.7), 0.6, IF(AND(M4>0.71, M4<=0.9), 0.8, 0.95))))","v":0.25},{"$f":"+B7/D7","v":0.18863636363636363},{"$f":"A4*(B7/D7)*R4","v":0},{"$f":"(A24/B24)*L4*$R$4","v":0}]
[]
[null,"Base rate",null,"Sq feet per acre"]
{"$rows_left_out":21}
{"sheet":"Water WW","index":15,"n_rows":103,"n_cols":23,"rows_kept":103,"cut":false,"hidden":true,"merged":[[19,0,19,1]]}
[]
["Residential Calculations"]
["Type","Sub Type","Tap Size","Water Meters needed","Lot Area","Bedrooms","Units","Peak GPD","BOD","TSS","Peak Annual","I&I Flow","Sub-Type City of Fort Collins","Water Meter Size","T/F","Water PIF","WSR (Ac-Ft)","WSR (Cash)","Meter Cost","Water Dev Rev","WW PIF","WW Dev Rev","Total"]
[{"$f":"+'Plan and Building Inputs'!$C$4","v":0},{"$f":"+'Plan and Building Inputs'!$C$7","v":0},{"$f":"+'Plan and Building Inputs'!$C$24","v":0},{"$f":"+'Plan and Building Inputs'!$C$25","v":0},{"$f":"+'Plan and Building Inputs'!$C$16","v":0},{"$f":"+'Plan and Building Inputs'!$C$13","v":0},{"$f":"+'Plan and Building Inputs'!$C$14","v":0},null,null,null,null,null,"Single Family - Attached",null,{"$f":"IF( A4=\"Residential\", B4=M4,C4=N4)","v":true},{"$f":"IF(O4=TRUE,_xlfn.IFS(AND(LEFT(B4,6)=\"Single\",C4=$N$22),P22+0.33*E4,AND(LEFT(B4,6)=\"Single\",C4=$N$23),P23+0.33*E4),0)","v":{"$error":"#N/A"}},{"$f":"IF(O4=TRUE,(((7.048*E4)+(12216.9*F4))/325851)*1.92,0)","v":0},{"$f":"Q4*R24","v":0},{"$f":"IF(O4=TRUE,_xlfn.IFS(AND(M4=B4,C4=N22),S22,AND(B4=M4,C4=N23),S23),0)","v":{"$error":"#N/A"}},{"$f":"IF(O4=TRUE,T23*G4,0)","v":0},{"$f":"+IF(O4=TRUE,(G4*U22),0)","v":0},{"$f":"IF(O4=TRUE,T23*G4,0)","v":0},{"$f":"SUM(R4:V4,P4)","v":{"$error":"#N/A"}}]
[{"$f":"+'Plan and Building Inputs'!$C$4","v":0},{"$f":"+'Plan and Building Inputs'!$C$7","v":0},{"$f":"+'Plan and Building Inputs'!$C$24","v":0},{"$f":"+'Plan and Building Inputs'!$C$25","v":0},{"$f":"+'Plan and Building Inputs'!$C$16","v":0},{"$f":"+'Plan and Building Inputs'!$C$13","v":0},{"$f":"+'Plan and Building Inputs'!$C$14","v":0},null,null,null,null,null,"Duplex",null,{"$f":"IF( A5=\"Residential\", B5=M5,C5=N5)","v":true},{"$f":"IF(O5=TRUE,(540*G5)+E5*0.24,0)","v":0},{"$f":"IF(O5=TRUE,(((7.048*E5)+(12216.9*F5))/325851)*1.92,0)","v":0},{"$f":"+Q5*R24","v":0},{"$f":"IF(O5=TRUE,_xlfn.IFS(AND(M5=B5,C5=N24),S24,AND(B5=M5,C5=N25),S25),0)","v":{"$error":"#N/A"}},{"$f":"IF(O5=TRUE,T24*G5,0)","v":0},{"$f":"IF(O5=TRUE,U24*G5,0)","v":0},{"$f":"IF(O5=TRUE,T24*G5,0)","v":0},{"$f":"SUM(R5:V5,P5)","v":{"$error":"#N/A"}}]
[{"$f":"+'Plan and Building Inputs'!$C$4","v":0},{"$f":"+'Plan and Building Inputs'!$C$7","v":0},{"$f":"+'Plan and Building Inputs'!$C$24","v":0},{"$f":"+'Plan and Building Inputs'!$C$25","v":0},{"$f":"+'Plan and Building Inputs'!$C$16","v":0},{"$f":"+'Plan and Building Inputs'!$C$13","v":0},{"$f":"+'Plan and Building Inputs'!$C$14","v":0},null,null,null,null,null,"Multi-Family",null,true,{"$f":"IF(O6=TRUE,(540*G6)+E6*0.24,0)","v":0},0,{"$f":"+Q6*$R$24","v":0},{"$f":"IF(O6=TRUE,_xlfn.IFS(AND(M6=B6,C6=N25),S25,AND(B6=M6,C6=N22),S22),0)","v":{"$error":"#N/A"}},{"$f":"IF(O6=TRUE,T25*G6,0)","v":0},{"$f":"IF(O6=TRUE,U25*G6,0)","v":0},0,{"$f":"SUM(R6:V6,P6)","v":{"$error":"#N/A"}}]
{"$rows_left_out":98}
{"sheet":"Capital Expansion","index":16,"n_rows":38,"n_cols":18,"rows_kept":38,"cut":false,"hidden":true,"merged":[]}
[]
[]
["Input","Type","Input","Units","Type","Land Use Type","Unit","Area Test","Type Test","Dwelling test","New/Addition","Cap Expansion Test","Parkland: Neighborhood","Parkland: Community","Fire Capital Exp","Police Capital Exp","General Govt. Capt. Exp. ","Transportation Capital Expansion"]
[{"$f":"+'Plan and Building Inputs'!$C$4","v":0},{"$f":"+'Plan and Building Inputs'!$C$5","v":0},{"$f":"+'Plan and Building Inputs'!$C$11","v":0},{"$f":"+'Plan and Building Inputs'!$C$14","v":0},"Residential","Resid., up to 700 sf","Dwelling",{"$f":"C4<=700","v":true},{"$f":"A4=E4","v":false},{"$f":"IF(AND(A4=\"Residential\",'Plan and Building Inputs'!$C$13>0,'Without Subs (OTC Permits)'!$C$19=0),TRUE,FALSE)","v":false},{"$f":"IF(OR('Plan and Building Inputs'!$C$5=\"New\",'Plan and Building Inputs'!$C$5=\"Addition\"),TRUE,FALSE)","v":false},{"$f":"IF(AND(H4=TRUE,I4=TRUE,J4=TRUE),TRUE,FALSE)","v":false},1647,2326,403,226,549,2321]
[{"$f":"+'Plan and Building Inputs'!$C$4","v":0},{"$f":"+'Plan and Building Inputs'!$C$5","v":0},{"$f":"+'Plan and Building Inputs'!$C$11","v":0},{"$f":"+'Plan and Building Inputs'!$C$14","v":0},"Residential","Resid., 701-1,200 sf","Dwelling",{"$f":"AND(C5>701, C5<=1200)","v":false},{"$f":"A5=E5","v":false},{"$f":"IF(AND(A5=\"Residential\",'Plan and Building Inputs'!$C$13>0,'Without Subs (OTC Permits)'!$C$19=0),TRUE,FALSE)","v":false},{"$f":"IF(OR('Plan and Building Inputs'!$C$5=\"New\",'Plan and Building Inputs'!$C$5=\"Addition\"),TRUE,FALSE)","v":false},{"$f":"IF(AND(H5=TRUE,I5=TRUE,J5=TRUE),TRUE,FALSE)","v":false},2205,3114,546,305,741,4310]
[{"$f":"+'Plan and Building Inputs'!$C$4","v":0},{"$f":"+'Plan and Building Inputs'!$C$5","v":0},{"$f":"+'Plan and Building Inputs'!$C$11","v":0},{"$f":"+'Plan and Building Inputs'!$C$14","v":0},"Residential","Resid., 1,201-1,700 sf"," Dwelling",{"$f":"AND(C6>1201, C6<=1700)","v":false},false,{"$f":"IF(AND(A6=\"Residential\",'Plan and Building Inputs'!$C$13>0,'Without Subs (OTC Permits)'!$C$19=0),TRUE,FALSE)","v":false},{"$f":"IF(OR('Plan and Building Inputs'!$C$5=\"New\",'Plan and Building Inputs'!$C$5=\"Addition\"),TRUE,FALSE)","v":false},false,2408,3400,593,332,809,5596]
{"$rows_left_out":33}
{"sheet":"Reference ->","index":17,"n_rows":114,"n_cols":6,"rows_kept":114,"cut":false,"hidden":true,"merged":[]}
["Fee Type",null,"Evaluation Criteria","Fee"," Location"]
["Plan check fee - Plan Review",null,"     $1 to $3,000","$0 - No plan review fee for valuations $3,000 and under","https://www.fcgov.com/building/fees.php"]
["Plan check fee - Plan Review",null,"     $3,001 to 25,000","$66.25 for first $2,000 plus\n$10.25 for each additional $1,000 or fraction thereof\nTake this total times 0.65","https://www.fcgov.com/building/fees.php"]
["Plan check fee - Plan Review",null,"     $25,001 to $50,000","$302 for the first $25,000 plus\n$8.50 for each additional $1,000 or fraction thereof\nTake this total times 0.65","https://www.fcgov.com/building/fees.php"]
["Plan check fee - Plan Review",null,"     $50,001 to$100,000","$514.50 for the first $50,000 plus\n$6.00 for each additional $1,000 or fraction thereof\nTake this total times 0.65","https://www.fcgov.com/building/fees.php"]
["Plan check fee - Plan Review",null,"     $100,001 to $500,000","$814.50 for the first $100,000 plus\n$4.00 for each additional $1,000 or fraction thereof\nTake this total times 0.65","https://www.fcgov.com/building/fees.php"]
{"$rows_left_out":109}
{"sheet":"Water","index":18,"n_rows":57,"n_cols":20,"rows_kept":57,"cut":false,"hidden":true,"merged":[[44,0,44,5]]}
["Water and Wastewater PIF's, WSR, and Dev Fees"]
["NOTE:  NO REFLECTION TO ANY PROPOSED CHANGES IN PIFS - PLEASE VERIFY",null,null,null,null,null,null,null,null,null,null,null,null,null,null,"Plant Investment & Dev Fees:",null,null,null,"https://www.fcgov.com/utilities/business/builders-and-developers/plant-investment-development-fees"]
["WITH UTILITY FEE AND RATE SPECIALIST AT UtilityFees@fcgov.com or 970-416-4252",null,null,null,null,null,null,null,null,null,null,null,null,null,null,"https://www.fcgov.com/utilities/utility-rates/"]
["***********Changes to PIFs &/or Dev Rev Fees will be effective April 2018************",null,null,null,null,null,null,null,null,null,null,null,null,null,null,"https://www.fcgov.com/utilities/manage-your-account/monitor-my-use/"]
[]
[]
{"$rows_left_out":52}
{"sheet":"pud calculation","index":19,"n_rows":51,"n_cols":6,"rows_kept":51,"cut":false,"hidden":true,"merged":[]}
["PRELIMINARY",null,null,"ESCROW:",0]
["________________ W/WW"]
["Reviewer:  "]
["B#"]
[]
["PUD Name:","name"]
{"$rows_left_out":45}